Unable to create frappe bench directory

Hi there,
I have installed bench successfully and when i execute command bench init frappe-bench && cd frappe-bench
I get the following error.

Traceback (most recent call last):
File “/usr/local/bin/bench”, line 11, in
load_entry_point(‘bench’, ‘console_scripts’, ‘bench’)()
File “/home/bench-repo/bench/cli.py”, line 40, in cli
File “/usr/local/lib/python2.7/dist-packages/click/core.py”, line 716, in call
return self.main(*args, **kwargs)
File “/usr/local/lib/python2.7/dist-packages/click/core.py”, line 696, in main
rv = self.invoke(ctx)
File “/usr/local/lib/python2.7/dist-packages/click/core.py”, line 1060, in invoke
return _process_result(sub_ctx.command.invoke(sub_ctx))
File “/usr/local/lib/python2.7/dist-packages/click/core.py”, line 889, in invoke
return ctx.invoke(self.callback, **ctx.params)
File “/usr/local/lib/python2.7/dist-packages/click/core.py”, line 534, in invoke
return callback(*args, **kwargs)
File “/home/bench-repo/bench/commands/make.py”, line 19, in init
verbose=verbose, clone_from=clone_from)
File “/home/bench-repo/bench/utils.py”, line 40, in init
File “/usr/lib/python2.7/os.py”, line 157, in makedirs
mkdir(name, mode)
OSError: [Errno 13] Permission denied: ‘frappe-bench’

Let me know how i can solve it.

Hi there while installing again using sudo python install.py --develop
i get the following error:

fatal: [localhost]: FAILED! => {“changed”: true, “cmd”: [“cp”, “-R”, “/tmp/.bench”, “/home/ujjawal/.bench”], “delta”: “0:00:00.001685”, “end”: “2016-10-01 07:38:42.526139”, “failed”: true, “rc”: 1, “start”: “2016-10-01 07:38:42.524454”, “stderr”: “cp: cannot create directory ‘/home/ujjawal/.bench’: Permission denied”, “stdout”: “”, “stdout_lines”: [], “warnings”: []}
to retry, use: --limit @develop/install.retry

PLAY RECAP *********************************************************************
localhost : ok=25 changed=2 unreachable=0 failed=1

Traceback (most recent call last):
File “install.py”, line 349, in
File “install.py”, line 108, in install_bench
run_playbook(‘develop/install.yml’, sudo=True, extra_vars=extra_vars)
File “install.py”, line 299, in run_playbook
success = subprocess.check_call(args, cwd=os.path.join(cwd, ‘playbooks’))
File “/usr/lib/python2.7/subprocess.py”, line 540, in check_call
raise CalledProcessError(retcode, cmd)
subprocess.CalledProcessError: Command ‘[‘ansible-playbook’, ‘-c’, ‘local’, ‘develop/install.yml’, ‘-e’, ‘@/tmp/extra_vars.json’, ‘–become’, ‘–become-user=ujjawal’]’ returned non-zero exit status 2